Realtek WLAN-Chip RTL8723de unter Ubuntu aktivieren

Wer sich in letzter Zeit ein Notebook mit dem WLAN-Chip RTL8723de von Realtek gekauft hat, der wird in die Röhre geschaut haben, sobald er versucht hat diesen unter Linux zum laufen zu bekommen. Nun gibt es allerdings seit einigen Tagen einen funktionsfähigen Treiber für Linux für eben diesen Chipsatz.

Ein HP-Notebook mit dem entsprechendem WLAN-Chip von Reaktek

Um diesen Treiber zu nutzen ist ein wenig Handarbeit nötig, da der Treiber noch nicht im Linux-Kernel vorhanden ist. Im ersten Schritt muss der Quelltext auf dem betreffenden Rechner kopiert werden. Dazu wird ein Terminal geöffnet und dort per Git das Repository mit dem Treiber bezogen:

git clone https://github.com/smlinux/rtl8723de.git

Anschließend wechseln wir in den Ordner und kompilieren den Treiber:

cd rtl8723de
make

Nun muss der Treiber nur noch installiert werden:

sudo make install

Nach einem Neustart ist der Treiber einsatzbereit und das WLAN kann genutzt werden.

3 Kommentare » Schreibe einen Kommentar

  1. das Scheint nicht zu funktionieren wenn ich make eingebe bekomme ich die meldung

    make ARCH=x86_64 CROSS_COMPILE= -C /lib/modules/4.4.0-104-generic/build M=/home/sven/rtl8723de modules
    make[1]: Verzeichnis „/usr/src/linux-headers-4.4.0-104-generic“ wird betreten
    CC [M] /home/sven/rtl8723de/core/rtw_cmd.o
    In file included from /home/sven/rtl8723de/include/drv_types.h:32:0,
    from /home/sven/rtl8723de/core/rtw_cmd.c:22:
    /home/sven/rtl8723de/include/osdep_service.h:41:33: fatal error: linux/sched/signal.h: Datei oder Verzeichnis nicht gefunden
    compilation terminated.
    scripts/Makefile.build:258: die Regel für Ziel „/home/sven/rtl8723de/core/rtw_cmd.o“ scheiterte
    make[2]: *** [/home/sven/rtl8723de/core/rtw_cmd.o] Fehler 1
    Makefile:1423: die Regel für Ziel „_module_/home/sven/rtl8723de“ scheiterte
    make[1]: *** [_module_/home/sven/rtl8723de] Fehler 2
    make[1]: Verzeichnis „/usr/src/linux-headers-4.4.0-104-generic“ wird verlassen
    Makefile:1884: die Regel für Ziel „modules“ scheiterte
    make: *** [modules] Fehler 2

Schreibe einen Kommentar

Pflichtfelder sind mit * markiert.